Target
1-acyl-sn-glycerol-3-phosphate acyltransferase beta
Ligand
BDBM50172955
Substrate
Meas. Tech.
ChEMBL_321473 (CHEMBL880414)
IC50
50±n/a nM
Citation
 Hong, FHollenback, DSinger, JWKlein, P Diamino-C,N-diarylpyridine positional isomers as inhibitors of lysophosphatidic acid acyltransferase-beta. Bioorg Med Chem Lett 15:4703-7 (2005)  
Target
Name:
1-acyl-sn-glycerol-3-phosphate acyltransferase beta
Synonyms:
1-acylglycerol-3-phosphate O-acyltransferase beta PLCB_HUMAN
Type:
PROTEIN
Mol. Mass.:
30924.09
Organism:
Homo sapiens (Human)
Description:
ChEMBL_321473
Residue:
278
  
Inhibitor
Name:
BDBM50172955
Synonyms:
4-(5-Chloro-2-ethoxy-phenyl)-N-(4-chloro-phenyl)-pyridine-2,6-diamine | CHEMBL194604
Type:
Small organic molecule
Emp. Form.:
C19H17Cl2N3O
Mol. Mass.:
374.264
SMILES:
CCOc1ccc(Cl)cc1-c1cc(N)nc(Nc2ccc(Cl)cc2)c1
: