Target
Adenosine receptor A2a
Ligand
BDBM50173189
Substrate
Meas. Tech.
ChEMBL_320973 (CHEMBL885380)
Ki
1±n/a nM
Citation
 Dowling, JEVessels, JTHaque, SChang, HXvan Vloten, KKumaravel, GEngber, TJin, XPhadke, DWang, JAyyub, EPetter, RC Synthesis of [1,2,4]triazolo[1,5-a]pyrazines as adenosine A2A receptor antagonists. Bioorg Med Chem Lett 15:4809-13 (2005)  
Target
Name:
Adenosine receptor A2a
Synonyms:
AA2AR_RAT Adenosine A2 receptor Adenosine Receptors A2a (A2a) Adenosine receptors A2a Rat striatal adenosine A2a receptor
Type:
G Protein-Coupled Receptor (GPCR)
Mol. Mass.:
45015.65
Organism:
Rattus norvegicus (rat)
Description:
Rat A2A receptors expressed in CHO cells.
Residue:
410
  
Inhibitor
Name:
BDBM50173189
Synonyms:
3-(8-Amino-2-furan-2-yl-[1,2,4]triazolo[1,5-a]pyrazin-6-yl)-N,N-diethyl-benzamide | CHEMBL196320
Type:
Small organic molecule
Emp. Form.:
C20H20N6O2
Mol. Mass.:
376.4118
SMILES:
CCN(CC)C(=O)c1cccc(c1)-c1cn2nc(nc2c(N)n1)-c1ccco1
: