Target
Serine/threonine-protein kinase mTOR
Ligand
BDBM50068561
Substrate
Meas. Tech.
ChEMBL_326904 (CHEMBL871328)
IC50
1.6±n/a nM
Citation
 Wagner, RMollison, KWLiu, LHenry, CLRosenberg, TABamaung, NTu, NWiedeman, PEOr, YLuly, JRLane, BCTrevillyan, JChen, YWFey, THsieh, GMarsh, KNuss, MJacobson, PBWilcox, DCarlson, RPCarter, GWDjuric, SW Rapamycin analogs with reduced systemic exposure. Bioorg Med Chem Lett 15:5340-3 (2005)  
Target
Name:
Serine/threonine-protein kinase mTOR
Synonyms:
FK506-binding protein 12-rapamycin complex-associated protein 1 FRAP FRAP1 MTOR Mammalian Target of Rapamycin (mTOR) RAFT1 Rapamycin and FKBP12 target 1 Serine/threonine-protein kinase (mTOR) | mTORC2
Type:
Rapamycin target protein
Mol. Mass.:
288917.12
Organism:
Homo sapiens (Human)
Description:
P42345
Residue:
2549
  
Inhibitor
Name:
BDBM50068561
Synonyms:
(16E,24E,26E,28E)-1,18-Dihydroxy-12-[2-(4-hydroxy-3-methoxy-cyclohexyl)-1-methyl-ethyl]-19,30-dimethoxy-15,17,21,23,29,35-hexamethyl-11,36-dioxa-4-aza-tricyclo[30.3.1.0*4,9*]hexatriaconta-16,24,26,28-tetraene-2 1,18-dihydroxy-12-{2-[4-hydroxy-3-methoxy-(4R)-cyclohexyl]-1-methylethyl}-19,30-dimethoxy-15,17,21,23,29,35-hexamethyl-11,36-dioxa-4-azatricyclo[30.3.1.04,9]hexatriaconta-16,24,26,28-tetraene-2,3,10,14,20-pentaone CHEMBL413 RAPAMYCIN IMMUNOSUPPRESSANT DRUG Rapamycin Sirolimus analogue | WY-090217
Type:
Small organic molecule
Emp. Form.:
C52H81NO14
Mol. Mass.:
944.1978
SMILES:
CO[C@@H]1C[C@H](CC(C)[C@@H]2CC(=O)[C@H](C)\C=C(C)\[C@H](O)[C@@H](OC)C(=O)[C@H](C)C[C@H](C)\C=C\C=C\C=C(C)\[C@H](C[C@H]3O[C@](O)([C@H](C)C[C@@H]3OC)C(=O)C(=O)N3CCCC[C@H]3C(=O)O2)OC)CC[C@H]1O
: