Target
RNA-directed RNA polymerase
Ligand
BDBM50115579
Substrate
Meas. Tech.
ChEMBL_321538 (CHEMBL880598)
pH
7.5±n/a
IC50
5600±n/a nM
Comments
extracted
Citation
 Di Santo, RFermeglia, MFerrone, MPaneni, MSCosti, RArtico, MRoux, AGabriele, MTardif, KDSiddiqui, APricl, S Simple but highly effective three-dimensional chemical-feature-based pharmacophore model for diketo acid derivatives as hepatitis C virus RNA-dependent RNA polymerase inhibitors. J Med Chem 48:6304-14 (2005)  
Target
Name:
RNA-directed RNA polymerase
Synonyms:
Hepatitis C virus NS5B RNA-dependent RNA polymerase | NS5B protein
Type:
Protein
Mol. Mass.:
25173.95
Organism:
Hepatitis C virus
Description:
Q8JXU8
Residue:
229
  
Inhibitor
Name:
BDBM50115579
Synonyms:
(Z)-2-hydroxy-4-oxo-4-phenyl-but-2-enoic acid 2-Hydroxy-4-oxo-4-phenyl-but-2-enoic acid (0.25H2O) CHEMBL19332 Sacchettini_CTRL
Type:
Small organic molecule
Emp. Form.:
C10H8O4
Mol. Mass.:
192.1681
SMILES:
OC(=O)C(=O)CC(=O)c1ccccc1
: