Target
Multidrug resistance-associated protein 1
Ligand
BDBM50174854
Substrate
Meas. Tech.
ChEMBL_326599 (CHEMBL863464)
IC50
38±n/a nM
Citation
 Norman, BHLander, PAGruber, JMKroin, JSCohen, JDJungheim, LNStarling, JJLaw, KLSelf, TDTabas, LBWilliams, DCPaul, DCDantzig, AH Cyclohexyl-linked tricyclic isoxazoles are potent and selective modulators of the multidrug resistance protein (MRP1). Bioorg Med Chem Lett 15:5526-30 (2005)  
Target
Name:
Multidrug resistance-associated protein 1
Synonyms:
7.6.2.2 ABCC1 ATP-binding cassette, sub-family C, member 1 isoform 1 LTC4 transporter MRP MRP1_HUMAN
Type:
Mol. Mass.:
171597.72
Organism:
Homo sapiens (Human)
Description:
P33527
Residue:
1531
  
Inhibitor
Name:
BDBM50174854
Synonyms:
CHEMBL200216 rac-N-((3-(9-chloro-3-methyl-4-oxoisoxazolo[4,3-c]quinolin-5(4H)-yl)cyclohexyl)methyl)benzamide
Type:
Small organic molecule
Emp. Form.:
C25H24ClN3O3
Mol. Mass.:
449.929
SMILES:
Cc1onc2c1c(=O)n([C@H]1CCC[C@@H](CNC(=O)c3ccccc3)C1)c1cccc(Cl)c21
: