Target
Sodium-dependent serotonin transporter
Ligand
BDBM50176041
Substrate
Meas. Tech.
ChEMBL_320901 (CHEMBL872400)
Ki
0.70±n/a nM
Citation
 Smid, PCoolen, HKKeizer, HGvan Hes, Rde Moes, JPden Hartog, APStork, BPlekkenpol, RHNiemann, LCStroomer, CNTulp, MTvan Stuivenberg, HHMcCreary, ACHesselink, MBHerremans, AHKruse, CG Synthesis, structure-activity relationships, and biological properties of 1-heteroaryl-4-[omega-(1H-indol-3-yl)alkyl]piperazines, novel potential antipsychotics combining potent dopamine D2 receptor antagonism with potent serotonin reuptake inhibition. J Med Chem 48:6855-69 (2005)  
Target
Name:
Sodium-dependent serotonin transporter
Synonyms:
5-HT Transporter 5HT transporter Anandamid membrane transporter, AMT Monoamine transporters; Norepinephrine & serotonin Slc6a4 Sodium-dependent serotonin transporter (SERT) | imipramine receptor
Type:
Multi-pass membrane protein
Mol. Mass.:
70168.43
Organism:
Rattus norvegicus (rat)
Description:
P31652
Residue:
630
  
Inhibitor
Name:
BDBM50176041
Synonyms:
(S)-8-{4-[3-(5-Fluoro-1H-indol-3-yl)-propyl]-piperazin-1-yl}-2-methyl-4H-benzo[1,4]oxazin-3-one | CHEMBL370457
Type:
Small organic molecule
Emp. Form.:
C24H27FN4O2
Mol. Mass.:
422.4952
SMILES:
C[C@@H]1Oc2c(NC1=O)cccc2N1CCN(CCCc2c[nH]c3ccc(F)cc23)CC1
: