Target
Cannabinoid receptor 2
Ligand
BDBM50176413
Substrate
Meas. Tech.
ChEMBL_333261 (CHEMBL859080)
Ki
>10000±n/a nM
Citation
 Carpino, PAGriffith, DASakya, SDow, RLBlack, SCHadcock, JRIredale, PAScott, DOFichtner, MWRose, CRDay, RDibrino, JButler, MDebartolo, DBDutcher, DGautreau, DLizano, JSO'connor, RESands, MAKelly-Sullivan, DWard, KM New bicyclic cannabinoid receptor-1 (CB1-R) antagonists. Bioorg Med Chem Lett 16:731-6 (2005)  
Target
Name:
Cannabinoid receptor 2
Synonyms:
CANNABINOID CB2 CB2 CB2B CNR2_HUMAN Cannabinoid CB2 receptor Cannabinoid receptor 2 (CB2R) | hCB2
Type:
G Protein-Coupled Receptor (GPCR)
Mol. Mass.:
39690.94
Organism:
Homo sapiens (Human)
Description:
P34972
Residue:
360
  
Inhibitor
Name:
BDBM50176413
Synonyms:
2-(2-chlorophenyl)-3-(4-chlorophenyl)-6-propyl-2H-pyrazolo[4,3-d]pyrimidin-7(6H)-one | CHEMBL203925
Type:
Small organic molecule
Emp. Form.:
C20H16Cl2N4O
Mol. Mass.:
399.273
SMILES:
CCCn1cnc2c(-c3ccc(Cl)cc3)n(nc2c1=O)-c1ccccc1Cl
: