Target
Alpha-1D adrenergic receptor
Ligand
BDBM50176526
Substrate
Meas. Tech.
ChEMBL_329195 (CHEMBL863435)
IC50
10550±n/a nM
Citation
 Vilar, SQuezada, ESantana, LUriarte, EYánez, MFraiz, NAlcaide, CCano, EOrallo, F Design, synthesis, and vasorelaxant and platelet antiaggregatory activities of coumarin-resveratrol hybrids. Bioorg Med Chem Lett 16:257-61 (2005)  
Target
Name:
Alpha-1D adrenergic receptor
Synonyms:
ADA1D_RAT Adra1d Alpha-1D adrenergic receptor | Serotonin 1a (5-HT1a) receptor/Adrenergic receptor alpha-1
Type:
Protein
Mol. Mass.:
59375.97
Organism:
Rattus norvegicus (Rat)
Description:
P23944
Residue:
561
  
Inhibitor
Name:
BDBM50176526
Synonyms:
6-hydroxy-3-(3',5'-dihydroxyphenyl)coumarin | CHEMBL199397
Type:
Small organic molecule
Emp. Form.:
C15H10O5
Mol. Mass.:
270.2369
SMILES:
Oc1ccc2oc(=O)c(cc2c1)-c1cc(O)cc(O)c1
: