Target
DNA polymerase III PolC-type
Ligand
BDBM50177655
Substrate
Meas. Tech.
ChEMBL_334135 (CHEMBL866436)
IC50
37000±n/a nM
Citation
 Rose, YCiblat, SReddy, RBelley, ACDietrich, ELehoux, DMcKay, GAPoirier, HFar, ARDelorme, D Novel non-nucleobase inhibitors of Staphylococcus aureus DNA polymerase IIIC. Bioorg Med Chem Lett 16:891-6 (2006)  
Target
Name:
DNA polymerase III PolC-type
Synonyms:
DPO3_STAAU | polC
Type:
PROTEIN
Mol. Mass.:
162439.74
Organism:
Staphylococcus aureus
Description:
ChEMBL_334135
Residue:
1435
  
Inhibitor
Name:
BDBM50177655
Synonyms:
5-benzyl-2-(2,3-dihydro-1H-inden-5-ylamino)-6-hydroxypyrimidin-4(3H)-one | CHEMBL380141
Type:
Small organic molecule
Emp. Form.:
C20H19N3O2
Mol. Mass.:
333.3838
SMILES:
Oc1nc(Nc2ccc3CCCc3c2)[nH]c(=O)c1Cc1ccccc1
: