Target
Kappa-type opioid receptor
Ligand
BDBM50177682
Substrate
Meas. Tech.
ChEMBL_333514 (CHEMBL866453)
Ki
260±n/a nM
Citation
 Le Bourdonnec, BGoodman, AJMichaut, MYe, HFGraczyk, TMBelanger, SDeHaven, RNDolle, RE Synthesis and structure-activity relationships of a new series of 2alpha-substituted trans-4,5-dimethyl-4-(3-hydroxyphenyl)piperidine as mu-selective opioid antagonists. Bioorg Med Chem Lett 16:864-8 (2006)  
Target
Name:
Kappa-type opioid receptor
Synonyms:
K-OR-1 Kappa-opioid receptor (KOR) Kappa-type opioid receptor (KOR) OPIATE Kappa OPRK1 kappa opioid receptor (KOR)
Type:
G Protein-Coupled Receptor (GPCR)
Mol. Mass.:
42648.76
Organism:
Homo sapiens (Human)
Description:
P41145
Residue:
380
  
Inhibitor
Name:
BDBM50177682
Synonyms:
3-(trans-4,5-dimethyl-1-phenethyl-2-alpha-(3-phenylpropyl)piperidin-4-yl)phenol | CHEMBL383044
Type:
Small organic molecule
Emp. Form.:
C30H37NO
Mol. Mass.:
427.6209
SMILES:
C[C@H]1CN(CCc2ccccc2)[C@H](CCCc2ccccc2)C[C@@]1(C)c1cccc(O)c1
: