Target
Sodium-dependent serotonin transporter
Ligand
BDBM50028094
Substrate
Meas. Tech.
ChEMBL_339938 (CHEMBL862304)
IC50
3±n/a nM
Citation
 Middleton, DSAndrews, MGlossop, PGymer, GJessiman, AJohnson, PSMackenny, MPitcher, MJRooker, TStobie, ATang, KMorgan, P Designing rapid onset selective serotonin re-uptake inhibitors. Part 1: Structure-activity relationships of substituted (1S,4S)-4-(3,4-dichlorophenyl)-N-methyl-1,2,3,4-tetrahydro-1-naphthaleneamine. Bioorg Med Chem Lett 16:1434-9 (2006)  
Target
Name:
Sodium-dependent serotonin transporter
Synonyms:
5-HT Transporter 5HTT SC6A4_HUMAN SLC6A4 Serotonin transporter (5HTT) Sodium-dependent serotonin transporter (SERT) | Solute carrier family 6 member 4
Type:
Multi-pass membrane protein
Mol. Mass.:
70322.51
Organism:
Homo sapiens (Human)
Description:
P31645
Residue:
630
  
Inhibitor
Name:
BDBM50028094
Synonyms:
(1S,4S)-4-(3,4-dichlorophenyl)-N-methyl-1,2,3,4-tetrahydronaphthalen-1-amine CHEMBL809 | SERTRALINE
Type:
Small organic molecule
Emp. Form.:
C17H17Cl2N
Mol. Mass.:
306.23
SMILES:
CN[C@H]1CC[C@@H](c2ccc(Cl)c(Cl)c2)c2ccccc12
: