Target
Catechol O-methyltransferase
Ligand
BDBM50108877
Substrate
Meas. Tech.
ChEMBL_325427 (CHEMBL858657)
IC50
930±n/a nM
Citation
 Learmonth, DABonifácio, MJSoares-da-Silva, P Synthesis and biological evaluation of a novel series of"ortho-nitrated" inhibitors of catechol-O-methyltransferase. J Med Chem 48:8070-8 (2005)  
Target
Name:
Catechol O-methyltransferase
Synonyms:
COMT_RAT Catechol-O-methyltransferase | Comt
Type:
Enzyme
Mol. Mass.:
29594.09
Organism:
Rattus norvegicus (Rat)
Description:
Residue:
264
  
Inhibitor
Name:
BDBM50108877
Synonyms:
(3,4-Dihydroxy-5-nitro-phenyl)-p-tolyl-methanone CHEMBL1324 TOLCAPONE Tasmar
Type:
Small organic molecule
Emp. Form.:
C14H11NO5
Mol. Mass.:
273.2408
SMILES:
Cc1ccc(cc1)C(=O)c1cc(O)c(O)c(c1)[N+]([O-])=O
: