Target
17-beta-hydroxysteroid dehydrogenase type 3
Ligand
BDBM50179958
Substrate
Meas. Tech.
ChEMBL_340362 (CHEMBL864403)
IC50
4±n/a nM
Citation
 Fink, BEGavai, AVTokarski, JSGoyal, BMisra, RXiao, HYKimball, SDHan, WCNorris, DSpires, TEYou, DGottardis, MMLorenzi, MVVite, GD Identification of a novel series of tetrahydrodibenzazocines as inhibitors of 17beta-hydroxysteroid dehydrogenase type 3. Bioorg Med Chem Lett 16:1532-6 (2006)  
Target
Name:
17-beta-hydroxysteroid dehydrogenase type 3
Synonyms:
17-beta-hydroxysteroid dehydrogenase type 3 EDH17B3 HSD17B3 | SDR12C2
Type:
Enzyme
Mol. Mass.:
34525.39
Organism:
Homo sapiens (Human)
Description:
P37058
Residue:
310
  
Inhibitor
Name:
BDBM50179958
Synonyms:
1-(9-benzylamino-11,12-dihydro-6H-dibenzo[b,f]azocin-5-yl)-ethanone | CHEMBL202916
Type:
Small organic molecule
Emp. Form.:
C24H24N2O
Mol. Mass.:
356.4602
SMILES:
CC(=O)N1Cc2ccc(NCc3ccccc3)cc2CCc2ccccc12
: