Target
17-beta-hydroxysteroid dehydrogenase type 3
Ligand
BDBM50179967
Substrate
Meas. Tech.
ChEMBL_340362 (CHEMBL864403)
IC50
2±n/a nM
Citation
 Fink, BEGavai, AVTokarski, JSGoyal, BMisra, RXiao, HYKimball, SDHan, WCNorris, DSpires, TEYou, DGottardis, MMLorenzi, MVVite, GD Identification of a novel series of tetrahydrodibenzazocines as inhibitors of 17beta-hydroxysteroid dehydrogenase type 3. Bioorg Med Chem Lett 16:1532-6 (2006)  
Target
Name:
17-beta-hydroxysteroid dehydrogenase type 3
Synonyms:
17-beta-hydroxysteroid dehydrogenase type 3 EDH17B3 HSD17B3 | SDR12C2
Type:
Enzyme
Mol. Mass.:
34525.39
Organism:
Homo sapiens (Human)
Description:
P37058
Residue:
310
  
Inhibitor
Name:
BDBM50179967
Synonyms:
3-(5-acetyl-2-chloro-5,6,11,12-tetrahydro-dibenzo[b,f]azocin-8-yl)-benzoic acid methyl ester | CHEMBL383546
Type:
Small organic molecule
Emp. Form.:
C25H22ClNO3
Mol. Mass.:
419.9
SMILES:
COC(=O)c1cccc(c1)-c1ccc2CCc3cc(Cl)ccc3N(Cc2c1)C(C)=O
: