Target
Matrix metalloproteinase-9
Ligand
BDBM50104001
Substrate
Meas. Tech.
ChEMBL_329822 (CHEMBL862785)
IC50
<0.100000±n/a nM
Citation
 Pirard, BMatter, H Matrix metalloproteinase target family landscape: a chemometrical approach to ligand selectivity based on protein binding site analysis. J Med Chem 49:51-69 (2006)  
Target
Name:
Matrix metalloproteinase-9
Synonyms:
67 kDa matrix metalloproteinase-9 92 kDa gelatinase CLG4B Gelatinase B MMP9 Matrix metalloproteinase 9 (MMP-9) Matrix metalloproteinase-9 (MMP9)
Type:
Enzyme
Mol. Mass.:
78452.28
Organism:
Homo sapiens (Human)
Description:
P14780
Residue:
707
  
Inhibitor
Name:
BDBM50104001
Synonyms:
4-(benzylthio)-N-hydroxy-2-(N-isobutyl-4-methoxyphenylsulfonamido)butanamide CHEMBL104022
Type:
Small organic molecule
Emp. Form.:
C22H30N2O5S2
Mol. Mass.:
466.614
SMILES:
COc1ccc(cc1)S(=O)(=O)N(CC(C)C)C(CCSCc1ccccc1)C(=O)NO
: