Target
Methionine aminopeptidase
Ligand
BDBM50180753
Substrate
Meas. Tech.
ChEMBL_329657 (CHEMBL865844)
IC50
>10000±n/a nM
Citation
 Schiffmann, RNeugebauer, AKlein, CD Metal-mediated inhibition of Escherichia coli methionine aminopeptidase: structure-activity relationships and development of a novel scoring function for metal-ligand interactions. J Med Chem 49:511-22 (2006)  
Target
Name:
Methionine aminopeptidase
Synonyms:
EcMetAP Methionine Aminopeptidase (MAP) Peptidase M | map
Type:
Enzyme
Mol. Mass.:
29326.96
Organism:
Escherichia coli (strain K12)
Description:
Full-length untagged EcMAP was expressed in E. coli.
Residue:
264
  
Inhibitor
Name:
BDBM50180753
Synonyms:
(5-benzoyl-1H-benzimidazol-2-yl)-carbamic acid methyl ester MBDZ Vermox | methyl (5-benzoyl-1H-benzimidazol-2-yl)carbamate
Type:
Small organic molecule
Emp. Form.:
C16H13N3O3
Mol. Mass.:
295.2927
SMILES:
COC(=O)Nc1nc2ccc(cc2[nH]1)C(=O)c1ccccc1
: