Target
Amine oxidase [flavin-containing] A
Ligand
BDBM50041234
Substrate
Meas. Tech.
ChEMBL_332420 (CHEMBL865201)
IC50
85110±n/a nM
Citation
 Santana, LUriarte, EGonzález-Díaz, HZagotto, GSoto-Otero, RMéndez-Alvarez, E A QSAR model for in silico screening of MAO-A inhibitors. Prediction, synthesis, and biological assay of novel coumarins. J Med Chem 49:1149-56 (2006)  
Target
Name:
Amine oxidase [flavin-containing] A
Synonyms:
AOFA_HUMAN MAO-A Monoamine oxidase Monoamine oxidase type A (MAO A) Monoamine oxidase type A (MAOA)
Type:
Protein
Mol. Mass.:
59689.53
Organism:
Homo sapiens (Human)
Description:
P21397
Residue:
527
  
Inhibitor
Name:
BDBM50041234
Synonyms:
6-hydroxy-7-methoxy-5-benzofuranacrylic acid delta-lactone 8-methoxy-2',3',6,7-furocoumarin 8-methoxy-[furano-3'.2':6.7-coumarin] 9-methoxy-7H-furo[3,2-g][1]benzopyran-7-one CHEMBL416 xanthotoxin
Type:
Small organic molecule
Emp. Form.:
C12H8O4
Mol. Mass.:
216.1895
SMILES:
COc1c2occc2cc2ccc(=O)oc12
: