Target
Polyunsaturated fatty acid 5-lipoxygenase
Ligand
BDBM50182301
Substrate
Meas. Tech.
ChEMBL_351709 (CHEMBL870098)
IC50
4.3±n/a nM
Citation
 Grimm, ELBrideau, CChauret, NChan, CCDelorme, DDucharme, YEthier, DFalgueyret, JPFriesen, RWGuay, JHamel, PRiendeau, DSoucy-Breau, CTagari, PGirard, Y Substituted coumarins as potent 5-lipoxygenase inhibitors. Bioorg Med Chem Lett 16:2528-31 (2006)  
Target
Name:
Polyunsaturated fatty acid 5-lipoxygenase
Synonyms:
5-LO 5-Lipoxygenase (5-LO) 5-Lipoygenase ALOX5 LOG5 | LOX5_HUMAN
Type:
Enzyme
Mol. Mass.:
77972.74
Organism:
Homo sapiens (Human)
Description:
Recombinant protein was purified from E. coli lysate. After ammonium sulfate precipitation and subsequent steps, the supernatant (S100) was used for 5-LO activity assay.
Residue:
674
  
Inhibitor
Name:
BDBM50182301
Synonyms:
4-(4-chlorophenyl)-7-(3-fluoro-5-(1,1,1,3,3,3-hexafluoro-2-hydroxypropan-2-yl)phenylthio)-2H-chromen-2-one | CHEMBL206632
Type:
Small organic molecule
Emp. Form.:
C24H12ClF7O3S
Mol. Mass.:
548.857
SMILES:
OC(c1cc(F)cc(Sc2ccc3c(cc(=O)oc3c2)-c2ccc(Cl)cc2)c1)(C(F)(F)F)C(F)(F)F
: