Target
Polyunsaturated fatty acid 5-lipoxygenase
Ligand
BDBM50182302
Substrate
Meas. Tech.
ChEMBL_351709 (CHEMBL870098)
IC50
1.9±n/a nM
Citation
 Grimm, ELBrideau, CChauret, NChan, CCDelorme, DDucharme, YEthier, DFalgueyret, JPFriesen, RWGuay, JHamel, PRiendeau, DSoucy-Breau, CTagari, PGirard, Y Substituted coumarins as potent 5-lipoxygenase inhibitors. Bioorg Med Chem Lett 16:2528-31 (2006)  
Target
Name:
Polyunsaturated fatty acid 5-lipoxygenase
Synonyms:
5-LO 5-Lipoxygenase (5-LO) 5-Lipoygenase ALOX5 LOG5 | LOX5_HUMAN
Type:
Enzyme
Mol. Mass.:
77972.74
Organism:
Homo sapiens (Human)
Description:
Recombinant protein was purified from E. coli lysate. After ammonium sulfate precipitation and subsequent steps, the supernatant (S100) was used for 5-LO activity assay.
Residue:
674
  
Inhibitor
Name:
BDBM50182302
Synonyms:
7-((3-fluoro-5-(1,1,1,3,3,3-hexafluoro-2-hydroxypropan-2-yl)phenoxy)methyl)-4-(4-fluorophenyl)-2H-chromen-2-one | CHEMBL205189
Type:
Small organic molecule
Emp. Form.:
C25H14F8O4
Mol. Mass.:
530.3635
SMILES:
OC(c1cc(F)cc(OCc2ccc3c(cc(=O)oc3c2)-c2ccc(F)cc2)c1)(C(F)(F)F)C(F)(F)F
: