Target
A disintegrin and metalloproteinase with thrombospondin motifs 4
Ligand
BDBM50183715
Substrate
Meas. Tech.
ChEMBL_354476 (CHEMBL853111)
Ki
4600±n/a nM
Citation
 Gilmore, JLKing, BWHarris, CMaduskuie, TMercer, SELiu, RQCovington, MBQian, MRibadeneria, MDVaddi, KTrzaskos, JMNewton, RCDecicco, CPDuan, JJ Synthesis and structure-activity relationship of a novel, achiral series of TNF-alpha converting enzyme inhibitors. Bioorg Med Chem Lett 16:2699-704 (2006)  
Target
Name:
A disintegrin and metalloproteinase with thrombospondin motifs 4
Synonyms:
A disintegrin and metalloproteinase with thrombospondin motifs 4 (ADAMTS-4) ATS4_HUMAN KIAA0688 | Metalloproteinase with thrombospondin motifs 4 (ADAMTS-4)
Type:
Enzyme
Mol. Mass.:
90214.54
Organism:
Homo sapiens (Human)
Description:
O75173
Residue:
837
  
Inhibitor
Name:
BDBM50183715
Synonyms:
CHEMBL207305 N-(4-(2-(hydroxyamino)-2-oxoethyl)tetrahydro-2H-pyran-4-yl)-4-((2-methylquinolin-4-yl)methoxy)benzamide
Type:
Small organic molecule
Emp. Form.:
C25H27N3O5
Mol. Mass.:
449.499
SMILES:
Cc1cc(COc2ccc(cc2)C(=O)NC2(CC(=O)NO)CCOCC2)c2ccccc2n1
: