Target
Proteasome subunit beta type-2
Ligand
BDBM50410902
Substrate
Meas. Tech.
ChEMBL_353295 (CHEMBL861974)
Ki
>450000±n/a nM
Citation
 Rydzewski, RMBurrill, LMendonca, RPalmer, JTRice, MTahilramani, RBass, KELeung, LGjerstad, EJanc, JWPan, L Optimization of subsite binding to the beta5 subunit of the human 20S proteasome using vinyl sulfones and 2-keto-1,3,4-oxadiazoles: syntheses and cellular properties of potent, selective proteasome inhibitors. J Med Chem 49:2953-68 (2006)  
Target
Name:
Proteasome subunit beta type-2
Synonyms:
20S proteasome PSMB2 | Proteasome Macropain subunit
Type:
PROTEIN
Mol. Mass.:
22837.53
Organism:
Homo sapiens (Human)
Description:
ChEMBL_1294233
Residue:
201
  
Inhibitor
Name:
BDBM50410902
Synonyms:
CHEMBL205687
Type:
Small organic molecule
Emp. Form.:
C31H40N6O7S
Mol. Mass.:
640.75
SMILES:
C[C@H](NC(=O)[C@H](CC(=O)NCC(C)(C)C)NS(=O)(=O)c1ccc(C)cc1)C(=O)NC(C)(C)C(=O)c1nnc(o1)-c1ccccc1
: