Target
Acetylcholinesterase
Ligand
BDBM50022775
Substrate
Meas. Tech.
ChEMBL_377861 (CHEMBL868604)
IC50
41100±n/a nM
Citation
 Sadashiva, CTNarendra Sharath Chandra, JNPonnappa, KCVeerabasappa Gowda, TRangappa, KS Synthesis and efficacy of 1-[bis(4-fluorophenyl)-methyl]piperazine derivatives for acetylcholinesterase inhibition, as a stimulant of central cholinergic neurotransmission in Alzheimer's disease. Bioorg Med Chem Lett 16:3932-6 (2006)  
Target
Name:
Acetylcholinesterase
Synonyms:
ACES_ELEEL Acetylcholinesterase (EeAChE) | ache
Type:
Enzyme
Mol. Mass.:
71812.79
Organism:
Electrophorus electricus (Electric eel)
Description:
Residue:
633
  
Inhibitor
Name:
BDBM50022775
Synonyms:
(m-Hydroxyphenyl)trimethylammonium dimethylcarbamate 3-[(dimethylcarbamoyl)oxy]-N,N,N-trimethylanilinium CHEMBL278020 Eustigmine Neostigmine (2) Vagostigmine | m-Trimethylammoniumphenyldimethylcarbamate
Type:
Small organic molecule
Emp. Form.:
C12H19N2O2
Mol. Mass.:
223.2909
SMILES:
CN(C)C(=O)Oc1cccc(c1)[N+](C)(C)C
: