Target
Genome polyprotein
Ligand
BDBM50055218
Substrate
Meas. Tech.
ChEMBL_362490 (CHEMBL866339)
IC50
4±n/a nM
Citation
 Zhou, LLiu, YZhang, WWei, PHuang, CPei, JYuan, YLai, L Isatin compounds as noncovalent SARS coronavirus 3C-like protease inhibitors. J Med Chem 49:3440-3 (2006)  
Target
Name:
Genome polyprotein
Synonyms:
Human rhinovirus A protease | Human rhinovirus B 3A protease
Type:
PROTEIN
Mol. Mass.:
44361.04
Organism:
Human rhinovirus B
Description:
ChEMBL_158953
Residue:
401
  
Inhibitor
Name:
BDBM50055218
Synonyms:
1-(2-naphthlmethyl) isatin-5-carboxamide CHEMBL358279 med.21724, Compound 108
Type:
Small organic molecule
Emp. Form.:
C20H14N2O3
Mol. Mass.:
330.3368
SMILES:
NC(=O)c1ccc2N(Cc3ccc4ccccc4c3)C(=O)C(=O)c2c1
: