Target
RNA-directed RNA polymerase
Ligand
BDBM50191522
Substrate
Meas. Tech.
ChEMBL_376990 (CHEMBL866684)
IC50
50±n/a nM
Citation
 Hirashima, SSuzuki, TIshida, TNoji, SYata, SAndo, IKomatsu, MIkeda, SHashimoto, H Benzimidazole derivatives bearing substituted biphenyls as hepatitis C virus NS5B RNA-dependent RNA polymerase inhibitors: structure-activity relationship studies and identification of a potent and highly selective inhibitor JTK-109. J Med Chem 49:4721-36 (2006)  
Target
Name:
RNA-directed RNA polymerase
Synonyms:
Hepatitis C virus NS5B RNA-dependent RNA polymerase | NS5B protein
Type:
Protein
Mol. Mass.:
25173.95
Organism:
Hepatitis C virus
Description:
Q8JXU8
Residue:
229
  
Inhibitor
Name:
BDBM50191522
Synonyms:
1-cyclohexyl-2-[4-(4,4'-dichlorobiphenyl-2-ylmethoxy)phenyl]-1H-benzimidazole-5-carboxylic acid | CHEMBL211507
Type:
Small organic molecule
Emp. Form.:
C33H28Cl2N2O3
Mol. Mass.:
571.493
SMILES:
OC(=O)c1ccc2n(C3CCCCC3)c(nc2c1)-c1ccc(OCc2cc(Cl)ccc2-c2ccc(Cl)cc2)cc1
: