Target
RNA-directed RNA polymerase
Ligand
BDBM50191530
Substrate
Meas. Tech.
ChEMBL_376990 (CHEMBL866684)
IC50
58±n/a nM
Citation
 Hirashima, SSuzuki, TIshida, TNoji, SYata, SAndo, IKomatsu, MIkeda, SHashimoto, H Benzimidazole derivatives bearing substituted biphenyls as hepatitis C virus NS5B RNA-dependent RNA polymerase inhibitors: structure-activity relationship studies and identification of a potent and highly selective inhibitor JTK-109. J Med Chem 49:4721-36 (2006)  
Target
Name:
RNA-directed RNA polymerase
Synonyms:
Hepatitis C virus NS5B RNA-dependent RNA polymerase | NS5B protein
Type:
Protein
Mol. Mass.:
25173.95
Organism:
Hepatitis C virus
Description:
Q8JXU8
Residue:
229
  
Inhibitor
Name:
BDBM50191530
Synonyms:
2-[4-(4'-carboxy-4-chlorobiphenyl-2-ylmethoxy)phenyl]-1-cyclohexyl-1H-benzimidazole-5-carboxylic acid | CHEMBL373930
Type:
Small organic molecule
Emp. Form.:
C34H29ClN2O5
Mol. Mass.:
581.057
SMILES:
OC(=O)c1ccc(cc1)-c1ccc(Cl)cc1COc1ccc(cc1)-c1nc2cc(ccc2n1C1CCCCC1)C(O)=O
: