Target
Sterol O-acyltransferase 2
Ligand
BDBM50193723
Substrate
Meas. Tech.
ChEMBL_424061 (CHEMBL855070)
IC50
89600±n/a nM
Citation
 Park, KHPark, YDHan, JMIm, KRLee, BWJeong, IYJeong, TSLee, WS Anti-atherosclerotic and anti-inflammatory activities of catecholic xanthones and flavonoids isolated from Cudrania tricuspidata. Bioorg Med Chem Lett 16:5580-3 (2006)  
Target
Name:
Sterol O-acyltransferase 2
Synonyms:
ACACT2 ACAT2 Acetyl-CoA transferase-like protein Cholesterol acyltransferase 2 SOAT2 | SOAT2_HUMAN
Type:
Enzyme
Mol. Mass.:
59912.75
Organism:
Homo sapiens (Human)
Description:
O75908
Residue:
522
  
Inhibitor
Name:
BDBM50193723
Synonyms:
(S)-2-(2,4-dihydroxy-5-(3-methylbut-2-enyl)phenyl)-5,7-dihydroxy-6-(3-methylbut-2-enyl)chroman-4-one | CHEMBL218741
Type:
Small organic molecule
Emp. Form.:
C25H28O6
Mol. Mass.:
424.4862
SMILES:
[#6]\[#6](-[#6])=[#6]\[#6]-c1cc(-[#6@@H]-2-[#6]-[#6](=O)-c3c(-[#8])c(-[#6]\[#6]=[#6](\[#6])-[#6])c(-[#8])cc3-[#8]-2)c(-[#8])cc1-[#8]
: