Target
11-beta-hydroxysteroid dehydrogenase type 2
Ligand
BDBM50193790
Substrate
Meas. Tech.
ChEMBL_424102 (CHEMBL856748)
IC50
20±n/a nM
Citation
 Yeh, VSKurukulasuriya, RFung, SMonzon, KChiou, WWang, JStolarik, DImade, HShapiro, RKnourek-Segel, VBush, EWilcox, DNguyen, PTBrune, MJacobson, PLink, JT Discovery of orally active butyrolactam 11beta-HSD1 inhibitors. Bioorg Med Chem Lett 16:5555-60 (2006)  
Target
Name:
11-beta-hydroxysteroid dehydrogenase type 2
Synonyms:
11-DH2 11-beta-Hydroxysteroid Dehydrogenase 2 (11-beta-HSD2) 11-beta-hydroxysteroid dehydrogenase 2 11-beta-hydroxysteroid dehydrogenase type 2 (11-beta-HSD2) DHI2_HUMAN HSD11K SDR9C3
Type:
Enzyme
Mol. Mass.:
44141.72
Organism:
Homo sapiens (Human)
Description:
Purified recombinant human 11beta-HSD2.
Residue:
405
  
Inhibitor
Name:
BDBM50193790
Synonyms:
6-((1-cycloheptyl-4,4-dimethyl-5-oxopyrrolidin-3-yl)methoxy)nicotinonitrile | CHEMBL384650
Type:
Small organic molecule
Emp. Form.:
C20H27N3O2
Mol. Mass.:
341.4473
SMILES:
CC1(C)C(COc2ccc(cn2)C#N)CN(C2CCCCCC2)C1=O
: