Target
Beta-3 adrenergic receptor
Ligand
BDBM50193803
Substrate
Meas. Tech.
ChEMBL_424173 (CHEMBL906194)
EC50
25±n/a nM
Citation
 Finley, DRBell, MGBorel, AGBloomquist, WECohen, MLHeiman, MLKriauciunas, AMatthews, DPMiles, TNeel, DARito, CJSall, DJShuker, AJStephens, TWTinsley, FCWinter, MAJesudason, CD Potent benzimidazolone based human beta(3)-adrenergic receptor agonists. Bioorg Med Chem Lett 16:5691-4 (2006)  
Target
Name:
Beta-3 adrenergic receptor
Synonyms:
ADRB3_RAT Adrb3r Beta-3 adrenergic receptor
Type:
PROTEIN
Mol. Mass.:
43161.83
Organism:
Rattus norvegicus
Description:
ChEMBL_1509452
Residue:
400
  
Inhibitor
Name:
BDBM50193803
Synonyms:
(S)-6-(4-(2-(2-hydroxy-3-(3-methyl-2-oxo-2,3-dihydro-1H-benzo[d]imidazol-4-yloxy)propylamino)-2-methylpropyl)phenoxy)nicotinamide | CHEMBL386016
Type:
Small organic molecule
Emp. Form.:
C27H31N5O5
Mol. Mass.:
505.5655
SMILES:
Cn1c2c(OC[C@@H](O)CNC(C)(C)Cc3ccc(Oc4ccc(cn4)C(N)=O)cc3)cccc2[nH]c1=O
: