Target
Glycogen phosphorylase, liver form
Ligand
BDBM50194411
Substrate
Meas. Tech.
ChEMBL_424360 (CHEMBL909563)
IC50
5±n/a nM
Citation
 Whittamore, PRAddie, MSBennett, SNBirch, AMButters, MGodfrey, LKenny, PWMorley, ADMurray, PMOikonomakos, NGOtterbein, LRPannifer, ADParker, JSReadman, KSiedlecki, PSSchofield, PStocker, ATaylor, MJTownsend, LAWhalley, DPWhitehouse, J Novel thienopyrrole glycogen phosphorylase inhibitors: synthesis, in vitro SAR and crystallographic studies. Bioorg Med Chem Lett 16:5567-71 (2006)  
Target
Name:
Glycogen phosphorylase, liver form
Synonyms:
Glycogen Phosphorylase (PYGL) Liver glycogen phosphorylase PYGL_HUMAN
Type:
Homodimer
Mol. Mass.:
97153.98
Organism:
Homo sapiens (Human)
Description:
Dimers associate into a tetramer to form the enzymatically active phosphorylase A.
Residue:
847
  
Inhibitor
Name:
BDBM50194411
Synonyms:
(S)-2,3-dichloro-N-(1-(dimethylamino)-1-oxo-3-phenylpropan-2-yl)-4H-thieno[3,2-b]pyrrole-5-carboxamide | CHEMBL217994
Type:
Small organic molecule
Emp. Form.:
C18H17Cl2N3O2S
Mol. Mass.:
410.317
SMILES:
CN(C)C(=O)[C@H](Cc1ccccc1)NC(=O)c1cc2sc(Cl)c(Cl)c2[nH]1
: