Target
Tyrosine-protein kinase Lck
Ligand
BDBM50194678
Substrate
Meas. Tech.
ChEMBL_396621 (CHEMBL913225)
IC50
0.400000±n/a nM
Citation
 DiMauro, EFNewcomb, JNunes, JJBemis, JEBoucher, CBuchanan, JLBuckner, WHCee, VJChai, LDeak, HLEpstein, LFFaust, TGallant, PGeuns-Meyer, SDGore, AGu, YHenkle, BHodous, BLHsieh, FHuang, XKim, JLLee, JHMartin, MWMasse, CEMcGowan, DCMetz, DMohn, DMorgenstern, KAOliveira-dos-Santos, APatel, VFPowers, DRose, PESchneider, STomlinson, SATudor, YYTurci, SMWelcher, AAWhite, RDZhao, HZhu, LZhu, X Discovery of aminoquinazolines as potent, orally bioavailable inhibitors of Lck: synthesis, SAR, and in vivo anti-inflammatory activity. J Med Chem 49:5671-86 (2006)  
Target
Name:
Tyrosine-protein kinase Lck
Synonyms:
2.7.10.2 LCK_HUMAN Leukocyte C-terminal Src kinase Lymphocyte-specific protein tyrosine kinase Protein YT16 Proto-oncogene tyrosine-protein kinase LCK T cell-specific protein-tyrosine kinase
Type:
Mol. Mass.:
57987.83
Organism:
Homo sapiens (Human)
Description:
P06239
Residue:
509
  
Inhibitor
Name:
BDBM50194678
Synonyms:
4-methyl-N-(2-methyl-3-(trifluoromethyl)phenyl)-3-(2-(3-morpholinopropylamino)quinazolin-6-yl)benzamide | CHEMBL214530
Type:
Small organic molecule
Emp. Form.:
C31H32F3N5O2
Mol. Mass.:
563.6133
SMILES:
Cc1ccc(cc1-c1ccc2nc(NCCCN3CCOCC3)ncc2c1)C(=O)Nc1cccc(c1C)C(F)(F)F
: