Target
5-hydroxytryptamine receptor 2A
Ligand
BDBM50194836
Substrate
Meas. Tech.
ChEMBL_424570 (CHEMBL853921)
IC50
1.4±n/a nM
Citation
 Swain, CJTeran, AMaroto, MCabello, A Identification and optimisation of 5-amino-7-aryldihydro-1,4-diazepines as 5-HT2A ligands. Bioorg Med Chem Lett 16:6058-62 (2006)  
Target
Name:
5-hydroxytryptamine receptor 2A
Synonyms:
5-HT-2 5-HT2A 5-hydroxytryptamine receptor 2A (5HT-2A) 5HT2A_HUMAN HTR2A | Serotonin receptor 2A
Type:
undefined
Mol. Mass.:
52607.65
Organism:
Homo sapiens (Human)
Description:
P28223
Residue:
471
  
Inhibitor
Name:
BDBM50194836
Synonyms:
CHEMBL436513 | N-(2-cyclobutylpropan-2-yl)-7-(2,4-difluorophenyl)-2,3-dihydro-1H-1,4-diazepin-5-amine
Type:
Small organic molecule
Emp. Form.:
C18H23F2N3
Mol. Mass.:
319.3921
SMILES:
CC(C)(N=C1CC(=NCCN1)c1ccc(F)cc1F)C1CCC1
: