Target
11-beta-hydroxysteroid dehydrogenase type 2
Ligand
BDBM50195488
Substrate
Meas. Tech.
ChEMBL_425008 (CHEMBL911428)
IC50
>10000±n/a nM
Citation
 Richards, SSorensen, BJae, HSWinn, MChen, YWang, JFung, SMonzon, KFrevert, EUJacobson, PSham, HLink, JT Discovery of potent and selective inhibitors of 11beta-HSD1 for the treatment of metabolic syndrome. Bioorg Med Chem Lett 16:6241-5 (2006)  
Target
Name:
11-beta-hydroxysteroid dehydrogenase type 2
Synonyms:
11-beta-hydroxysteroid dehydrogenase 2 Hsd11b2 | Hsd11k
Type:
PROTEIN
Mol. Mass.:
43740.05
Organism:
Rattus norvegicus
Description:
ChEMBL_735659
Residue:
400
  
Inhibitor
Name:
BDBM50195488
Synonyms:
CHEMBL374487 | N-((1s,4s)-4-((2-(dimethylamino)ethyl)carbamoyl)cyclohexyl)-4-amino-3,5-dichloro-N-cyclopropylbenzamide
Type:
Small organic molecule
Emp. Form.:
C21H30Cl2N4O2
Mol. Mass.:
441.395
SMILES:
CN(C)CCNC(=O)[C@@H]1CC[C@@H](CC1)N(C1CC1)C(=O)c1cc(Cl)c(N)c(Cl)c1
: