Target
11-beta-hydroxysteroid dehydrogenase 1
Ligand
BDBM50197409
Substrate
Meas. Tech.
ChEMBL_453207 (CHEMBL902361)
Ki
7±n/a nM
Citation
 Sorensen, BWinn, MRohde, JShuai, QWang, JFung, SMonzon, KChiou, WStolarik, DImade, HPan, LDeng, XChovan, LLongenecker, KJudge, RQin, WBrune, MCamp, HFrevert, EUJacobson, PLink, JT Adamantane sulfone and sulfonamide 11-beta-HSD1 Inhibitors. Bioorg Med Chem Lett 17:527-32 (2007)  
Target
Name:
11-beta-hydroxysteroid dehydrogenase 1
Synonyms:
11-DH 11-beta-Hydroxysteroid Dehydrogenase 1 (11-beta-HSD1) 11beta-HSD1A Corticosteroid 11-beta-dehydrogenase isozyme 1 (11-beta-HSD-1) Hsd11 | Hsd11b1
Type:
Enzyme
Mol. Mass.:
32369.70
Organism:
Mus musculus (mouse)
Description:
P50172
Residue:
292
  
Inhibitor
Name:
BDBM50197409
Synonyms:
2-(2-chloro-4-fluoro-phenoxy)-N-(5-ethanesulfonyl-adamantan-2-yl)-2-methyl-propionamide | CHEMBL241709
Type:
Small organic molecule
Emp. Form.:
C22H29ClFNO4S
Mol. Mass.:
457.986
SMILES:
CCS(=O)(=O)[C@@]12CC3CC(C1)[C@H](NC(=O)C(C)(C)Oc1ccc(F)cc1Cl)C(C3)C2
: