Target
Adenosine receptor A3
Ligand
BDBM50199968
Substrate
Meas. Tech.
ChEMBL_422428 (CHEMBL909840)
Ki
10.3±n/a nM
Citation
 Cosyn, LPalaniappan, KKKim, SKDuong, HTGao, ZGJacobson, KAVan Calenbergh, S 2-triazole-substituted adenosines: a new class of selective A3 adenosine receptor agonists, partial agonists, and antagonists. J Med Chem 49:7373-83 (2006)  
Target
Name:
Adenosine receptor A3
Synonyms:
A3 adenosine receptor (hA3) ADORA3 | Adenosine A3 receptor (A3AR)
Type:
G Protein-Coupled Receptor (GPCR)
Mol. Mass.:
36197.32
Organism:
Homo sapiens (Human)
Description:
P0DMS8
Residue:
318
  
Inhibitor
Name:
BDBM50199968
Synonyms:
CHEMBL218326 | N6-methyl-2-[4-pyridin-2-yl-1,2,3-triazol-1-yl]-9-(beta-D-ribofuranosyl)adenine
Type:
Small organic molecule
Emp. Form.:
C18H19N9O4
Mol. Mass.:
425.4014
SMILES:
CNc1nc(nc2n(cnc12)[C@@H]1O[C@H](CO)[C@@H](O)[C@H]1O)-n1cc(nn1)-c1ccccn1
: