Target
Adenosine receptor A3
Ligand
BDBM50199980
Substrate
Meas. Tech.
ChEMBL_422431 (CHEMBL909306)
Ki
>10000±n/a nM
Citation
 Cosyn, LPalaniappan, KKKim, SKDuong, HTGao, ZGJacobson, KAVan Calenbergh, S 2-triazole-substituted adenosines: a new class of selective A3 adenosine receptor agonists, partial agonists, and antagonists. J Med Chem 49:7373-83 (2006)  
Target
Name:
Adenosine receptor A3
Synonyms:
AA3R_RAT Adenosine receptor A2a and A3 | Adora3
Type:
PROTEIN
Mol. Mass.:
36643.73
Organism:
Rattus norvegicus
Description:
ChEMBL_479910
Residue:
320
  
Inhibitor
Name:
BDBM50199980
Synonyms:
2-(4-dimethylaminomethyl-1,2,3-triazol-1-yl)-N6-methyl-9-(beta-D-ribofuranosyl)adenine | CHEMBL374645
Type:
Small organic molecule
Emp. Form.:
C16H23N9O4
Mol. Mass.:
405.4117
SMILES:
CNc1nc(nc2n(cnc12)[C@@H]1O[C@H](CO)[C@@H](O)[C@H]1O)-n1cc(CN(C)C)nn1
: