Target
Adenosine receptor A3
Ligand
BDBM50199987
Substrate
Meas. Tech.
ChEMBL_422428 (CHEMBL909840)
Ki
21.3±n/a nM
Citation
 Cosyn, LPalaniappan, KKKim, SKDuong, HTGao, ZGJacobson, KAVan Calenbergh, S 2-triazole-substituted adenosines: a new class of selective A3 adenosine receptor agonists, partial agonists, and antagonists. J Med Chem 49:7373-83 (2006)  
Target
Name:
Adenosine receptor A3
Synonyms:
A3 adenosine receptor (hA3) ADORA3 | Adenosine A3 receptor (A3AR)
Type:
G Protein-Coupled Receptor (GPCR)
Mol. Mass.:
36197.32
Organism:
Homo sapiens (Human)
Description:
P0DMS8
Residue:
318
  
Inhibitor
Name:
BDBM50199987
Synonyms:
2-(4-cyclohexylmethyl-1,2,3-triazol-1-yl)-N6-methyl-9-(beta-D-ribofuranosyl)adenine | CHEMBL376249
Type:
Small organic molecule
Emp. Form.:
C20H28N8O4
Mol. Mass.:
444.4875
SMILES:
CNc1nc(nc2n(cnc12)[C@@H]1O[C@H](CO)[C@@H](O)[C@H]1O)-n1cc(CC2CCCCC2)nn1
: