Target
Adenosine receptor A1
Ligand
BDBM50199973
Substrate
Meas. Tech.
ChEMBL_422429 (CHEMBL909304)
Ki
230±n/a nM
Citation
 Cosyn, LPalaniappan, KKKim, SKDuong, HTGao, ZGJacobson, KAVan Calenbergh, S 2-triazole-substituted adenosines: a new class of selective A3 adenosine receptor agonists, partial agonists, and antagonists. J Med Chem 49:7373-83 (2006)  
Target
Name:
Adenosine receptor A1
Synonyms:
A1 adenosine receptor (hA1) AA1R_HUMAN ADORA1 Adenosine A1-receptor Adenosine receptor A1 (hA1) | Adenosine transporter (AdT)
Type:
G Protein-Coupled Receptor (GPCR)
Mol. Mass.:
36520.92
Organism:
Homo sapiens (Human)
Description:
P30542
Residue:
326
  
Inhibitor
Name:
BDBM50199973
Synonyms:
2-azido-N6-methyl-9-(beta-D-ribofuranosyl)adenine | CHEMBL384425
Type:
Small organic molecule
Emp. Form.:
C11H14N8O4
Mol. Mass.:
322.2801
SMILES:
CNc1nc(N=[N+]=[N-])nc2n(cnc12)[C@@H]1O[C@H](CO)[C@@H](O)[C@H]1O
: