Target
Adenosine receptor A1
Ligand
BDBM50199983
Substrate
Meas. Tech.
ChEMBL_422429 (CHEMBL909304)
Ki
750±n/a nM
Citation
 Cosyn, LPalaniappan, KKKim, SKDuong, HTGao, ZGJacobson, KAVan Calenbergh, S 2-triazole-substituted adenosines: a new class of selective A3 adenosine receptor agonists, partial agonists, and antagonists. J Med Chem 49:7373-83 (2006)  
Target
Name:
Adenosine receptor A1
Synonyms:
A1 adenosine receptor (hA1) AA1R_HUMAN ADORA1 Adenosine A1-receptor Adenosine receptor A1 (hA1) | Adenosine transporter (AdT)
Type:
G Protein-Coupled Receptor (GPCR)
Mol. Mass.:
36520.92
Organism:
Homo sapiens (Human)
Description:
P30542
Residue:
326
  
Inhibitor
Name:
BDBM50199983
Synonyms:
2-(4-butyl-1,2,3-triazol-1-yl)-9-(5-ethylcarbamoyl-beta-D-ribofuranosyl)-N6-methyladenine | CHEMBL374768
Type:
Small organic molecule
Emp. Form.:
C19H27N9O4
Mol. Mass.:
445.4756
SMILES:
CCCCc1cn(nn1)-c1nc(NC)c2ncn([C@@H]3O[C@@H]([C@@H](O)[C@H]3O)C(=O)NCC)c2n1
: