Target
11-beta-hydroxysteroid dehydrogenase 1
Ligand
BDBM50202097
Substrate
Meas. Tech.
ChEMBL_423355 (CHEMBL909896)
Ki
8±n/a nM
Citation
 Rohde, JJPliushchev, MASorensen, BKWodka, DShuai, QWang, JFung, SMonzon, KMChiou, WJPan, LDeng, XChovan, LERamaiya, AMullally, MHenry, RFStolarik, DFImade, HMMarsh, KCBeno, DWFey, TADroz, BABrune, MECamp, HSSham, HLFrevert, EUJacobson, PBLink, JT Discovery and metabolic stabilization of potent and selective 2-amino-N-(adamant-2-yl) acetamide 11beta-hydroxysteroid dehydrogenase type 1 inhibitors. J Med Chem 50:149-64 (2007)  
Target
Name:
11-beta-hydroxysteroid dehydrogenase 1
Synonyms:
11-DH 11-beta-Hydroxysteroid Dehydrogenase 1 (11-beta-HSD1) 11beta-HSD1A Corticosteroid 11-beta-dehydrogenase isozyme 1 (11-beta-HSD-1) Hsd11 | Hsd11b1
Type:
Enzyme
Mol. Mass.:
32369.70
Organism:
Mus musculus (mouse)
Description:
P50172
Residue:
292
  
Inhibitor
Name:
BDBM50202097
Synonyms:
CHEMBL424937 | N-[(E)-5-hydroxy-2-adamantyl]-2-methyl-2-{4-[5-(trifluoromethyl)pyridin-2-yl]piperazin-1-yl}propanamide
Type:
Small organic molecule
Emp. Form.:
C24H33F3N4O2
Mol. Mass.:
466.5396
SMILES:
CC(C)(N1CCN(CC1)c1ccc(cn1)C(F)(F)F)C(=O)N[C@H]1C2CC3CC1C[C@](O)(C3)C2
: