Target
11-beta-hydroxysteroid dehydrogenase type 2
Ligand
BDBM50202094
Substrate
Meas. Tech.
ChEMBL_423374 (CHEMBL909360)
IC50
>100000±n/a nM
Citation
 Rohde, JJPliushchev, MASorensen, BKWodka, DShuai, QWang, JFung, SMonzon, KMChiou, WJPan, LDeng, XChovan, LERamaiya, AMullally, MHenry, RFStolarik, DFImade, HMMarsh, KCBeno, DWFey, TADroz, BABrune, MECamp, HSSham, HLFrevert, EUJacobson, PBLink, JT Discovery and metabolic stabilization of potent and selective 2-amino-N-(adamant-2-yl) acetamide 11beta-hydroxysteroid dehydrogenase type 1 inhibitors. J Med Chem 50:149-64 (2007)  
Target
Name:
11-beta-hydroxysteroid dehydrogenase type 2
Synonyms:
11-beta-hydroxysteroid dehydrogenase 2 Hsd11b2 | Hsd11k
Type:
PROTEIN
Mol. Mass.:
43740.05
Organism:
Rattus norvegicus
Description:
ChEMBL_735659
Residue:
400
  
Inhibitor
Name:
BDBM50202094
Synonyms:
CHEMBL375341 | N-(5-hydroxy-adamantan-2-yl)-2-(3-trifluoromethyl-pyrrolidin-1-yl)-acetamide
Type:
Small organic molecule
Emp. Form.:
C17H25F3N2O2
Mol. Mass.:
346.3878
SMILES:
O[C@@]12CC3CC(C1)[C@H](NC(=O)CN1CC[C@@H](C1)C(F)(F)F)C(C3)C2
: