Target
Adenosine receptor A2a
Ligand
BDBM50202997
Substrate
Meas. Tech.
ChEMBL_454087 (CHEMBL903278)
Ki
1.3±n/a nM
Citation
 Neustadt, BRHao, JLindo, NGreenlee, WJStamford, AWTulshian, DOngini, EHunter, JMonopoli, ABertorelli, RFoster, CArik, LLachowicz, JNg, KFeng, KI Potent, selective, and orally active adenosine A2A receptor antagonists: arylpiperazine derivatives of pyrazolo[4,3-e]-1,2,4-triazolo[1,5-c]pyrimidines. Bioorg Med Chem Lett 17:1376-80 (2007)  
Target
Name:
Adenosine receptor A2a
Synonyms:
A2A adenosine receptor (hA2A) ADENOSINE A2 ADORA2 Adenosine A2A receptor (A2AAR)
Type:
G Protein-Coupled Receptor (GPCR)
Mol. Mass.:
44716.46
Organism:
Homo sapiens (Human)
Description:
P29274
Residue:
412
  
Inhibitor
Name:
BDBM50202997
Synonyms:
4-{4-[2-(5-amino-2-furan-2-yl-pyrazolo[4,3-e][1,2,4]triazolo[1,5-c]pyrimidin-7-yl)-ethyl]-piperazin-1-yl}-phenol | CHEMBL240030
Type:
Small organic molecule
Emp. Form.:
C22H23N9O2
Mol. Mass.:
445.4771
SMILES:
Nc1nc2n(CCN3CCN(CC3)c3ccc(O)cc3)ncc2c2nc(nn12)-c1ccco1
: