Target
B1 bradykinin receptor
Ligand
BDBM50203205
Substrate
Meas. Tech.
ChEMBL_425211 (CHEMBL855157)
Ki
0.24±n/a nM
Citation
 D'Amico, DCAya, THuman, JFotsch, CChen, JJBiswas, KRiahi, BNorman, MHWilloughby, CAHungate, RReider, PJBiddlecome, GLester-Zeiner, DStaden, CVJohnson, EKamassah, AArik, LWang, JViswanadhan, VNGroneberg, RDZhan, JSuzuki, HToro, AMareska, DAClarke, DEHarvey, DMBurgess, LELaird, ERAskew, BNg, G Identification of a nonpeptidic and conformationally restricted bradykinin B1 receptor antagonist with anti-inflammatory activity. J Med Chem 50:607-10 (2007)  
Target
Name:
B1 bradykinin receptor
Synonyms:
B1 BRADYKININ B1R BK-1 receptor BRADYB1 | Bradykinin B1 receptor
Type:
Enzyme
Mol. Mass.:
40508.87
Organism:
Homo sapiens (Human)
Description:
P46663
Residue:
353
  
Inhibitor
Name:
BDBM50203205
Synonyms:
(R)-3-(naphthalene-3-sulfonamido)-3-phenyl-N-((R)-6-(piperidin-1-ylmethyl)-1,2,3,4-tetrahydronaphthalen-1-yl)propanamide CHEMBL218152
Type:
Small organic molecule
Emp. Form.:
C35H39N3O3S
Mol. Mass.:
581.767
SMILES:
O=C(C[C@@H](NS(=O)(=O)c1ccc2ccccc2c1)c1ccccc1)N[C@@H]1CCCc2cc(CN3CCCCC3)ccc12
: