Target
Tyrosine-protein phosphatase non-receptor type 1
Ligand
BDBM50131550
Substrate
Meas. Tech.
ChEMBL_425375 (CHEMBL909070)
Ki
2.4±n/a nM
Citation
 Boutselis, IGYu, XZhang, ZYBorch, RF Synthesis and cell-based activity of a potent and selective protein tyrosine phosphatase 1B inhibitor prodrug. J Med Chem 50:856-64 (2007)  
Target
Name:
Tyrosine-protein phosphatase non-receptor type 1
Synonyms:
PTN1_HUMAN PTPN1 Protein tyrosine phosphatase-1B (PTP1B) Protein-tyrosine phosphatase 1B (PTP1B) Tyrosine-protein phosphatase non-receptor type 1 (PTP1B)
Type:
Protein phosphatase
Mol. Mass.:
49963.76
Organism:
Homo sapiens (Human)
Description:
Human recombinant GST-fusion PTP1B (1-435).
Residue:
435
  
Inhibitor
Name:
BDBM50131550
Synonyms:
(3S)-3-{[(1S)-1-carbamoyl-2-{4-[difluoro(phosphono)methyl]phenyl}ethyl]carbamoyl}-3-(2-{4-[difluoro(phosphono)methyl]phenyl}acetamido)propanoic acid CHEMBL326115 | N-{1-Carbamoyl-2-[4-(difluoro-phosphono-methyl)-phenyl]-ethyl}-3-{2-[4-(difluoro-phosphono-methyl)-phenyl]-acetylamino}-succinamic acid
Type:
Small organic molecule
Emp. Form.:
C23H25F4N3O11P2
Mol. Mass.:
657.3992
SMILES:
NC(=O)[C@H](Cc1ccc(cc1)C(F)(F)P(O)(O)=O)NC(=O)[C@H](CC(O)=O)NC(=O)Cc1ccc(cc1)C(F)(F)P(O)(O)=O
: