Target
5-hydroxytryptamine receptor 2A
Ligand
BDBM50203375
Substrate
Meas. Tech.
ChEMBL_441843 (CHEMBL890994)
Ki
>1000±n/a nM
Citation
 Carato, PGraulich, AJensen, NRoth, BLLiégeois, JF Synthesis and in vitro binding studies of substituted piperidine naphthamides. Part II: Influence of the substitution on the benzyl moiety on the affinity for D2L, D4.2, and 5-HT2A receptors. Bioorg Med Chem Lett 17:1570-4 (2007)  
Target
Name:
5-hydroxytryptamine receptor 2A
Synonyms:
5-HT-2A 5-HT2A 5-hydroxytryptamine receptor 2A (5HT2A) Htr2 Serotonin Receptor 2A
Type:
G Protein-Coupled Receptor (GPCR)
Mol. Mass.:
52852.05
Organism:
Rattus norvegicus (rat)
Description:
Rat cortex membranes 5-HT2A receptors.
Residue:
471
  
Inhibitor
Name:
BDBM50203375
Synonyms:
CHEMBL229019 N-(1-benzylpiperidine-4-yl)-1-naphthamide
Type:
Small organic molecule
Emp. Form.:
C23H24N2O
Mol. Mass.:
344.4495
SMILES:
O=C(NC1CCN(Cc2ccccc2)CC1)c1cccc2ccccc12
: