Target
D(4) dopamine receptor
Ligand
BDBM50203397
Substrate
Meas. Tech.
ChEMBL_441841 (CHEMBL890992)
Ki
16±n/a nM
Citation
 Carato, PGraulich, AJensen, NRoth, BLLiégeois, JF Synthesis and in vitro binding studies of substituted piperidine naphthamides. Part II: Influence of the substitution on the benzyl moiety on the affinity for D2L, D4.2, and 5-HT2A receptors. Bioorg Med Chem Lett 17:1570-4 (2007)  
Target
Name:
D(4) dopamine receptor
Synonyms:
D(2C) dopamine receptor DOPAMINE D4.2 DRD4 Dopamine D4 receptor
Type:
Enzyme
Mol. Mass.:
48373.19
Organism:
Homo sapiens (Human)
Description:
P21917
Residue:
419
  
Inhibitor
Name:
BDBM50203397
Synonyms:
CHEMBL234645 | N-(1-(3-methoxybenzyl)piperidin-4-yl)-2-naphthamide
Type:
Small organic molecule
Emp. Form.:
C24H26N2O2
Mol. Mass.:
374.4754
SMILES:
COc1cccc(CN2CCC(CC2)NC(=O)c2ccc3ccccc3c2)c1
: