Target
D(4) dopamine receptor
Ligand
BDBM50203466
Substrate
Meas. Tech.
ChEMBL_438238 (CHEMBL887347)
Ki
281±n/a nM
Citation
 Carato, PGraulich, AJensen, NRoth, BLLiégeois, JF Synthesis and in vitro binding studies of substituted piperidine naphthamides. Part I: Influence of the substitution on the basic nitrogen and the position of the amide on the affinity for D2L, D4.2, and 5-HT2A receptors. Bioorg Med Chem Lett 17:1565-9 (2007)  
Target
Name:
D(4) dopamine receptor
Synonyms:
D(2C) dopamine receptor DOPAMINE D4.2 DRD4 Dopamine D4 receptor
Type:
Enzyme
Mol. Mass.:
48373.19
Organism:
Homo sapiens (Human)
Description:
P21917
Residue:
419
  
Inhibitor
Name:
BDBM50203466
Synonyms:
CHEMBL229025 | N-(1-(4-phenylbutyl)piperidin-4-yl)-2-naphthamide
Type:
Small organic molecule
Emp. Form.:
C26H30N2O
Mol. Mass.:
386.5292
SMILES:
O=C(NC1CCN(CCCCc2ccccc2)CC1)c1ccc2ccccc2c1
: