Target
5-hydroxytryptamine receptor 2A
Ligand
BDBM50203474
Substrate
Meas. Tech.
ChEMBL_438239 (CHEMBL887348)
Ki
248±n/a nM
Citation
 Carato, PGraulich, AJensen, NRoth, BLLiégeois, JF Synthesis and in vitro binding studies of substituted piperidine naphthamides. Part I: Influence of the substitution on the basic nitrogen and the position of the amide on the affinity for D2L, D4.2, and 5-HT2A receptors. Bioorg Med Chem Lett 17:1565-9 (2007)  
Target
Name:
5-hydroxytryptamine receptor 2A
Synonyms:
5-HT-2A 5-HT2A 5-hydroxytryptamine receptor 2A (5HT2A) Htr2 Serotonin Receptor 2A
Type:
G Protein-Coupled Receptor (GPCR)
Mol. Mass.:
52852.05
Organism:
Rattus norvegicus (rat)
Description:
Rat cortex membranes 5-HT2A receptors.
Residue:
471
  
Inhibitor
Name:
BDBM50203474
Synonyms:
CHEMBL228865 | N-(1-(1-phenylethyl)piperidin-4-yl)-1-naphthamide
Type:
Small organic molecule
Emp. Form.:
C24H26N2O
Mol. Mass.:
358.476
SMILES:
CC(N1CCC(CC1)NC(=O)c1cccc2ccccc12)c1ccccc1
: