Target
Estrogen receptor
Ligand
BDBM50204803
Substrate
Meas. Tech.
ChEMBL_454488 (CHEMBL886514)
IC50
11±n/a nM
Citation
 Dykstra, KDGuo, LBirzin, ETChan, WYang, YTHayes, ECDaSilva, CAPai, LYMosley, RTKraker, BFitzgerald, PMDiNinno, FRohrer, SPSchaeffer, JMHammond, ML Estrogen receptor ligands. Part 16: 2-Aryl indoles as highly subtype selective ligands for ERalpha. Bioorg Med Chem Lett 17:2322-8 (2007)  
Target
Name:
Estrogen receptor
Synonyms:
ER ESR ESR1_HUMAN Estrogen receptor Estrogen receptor (ER-alpha) Estrogen receptor alpha (ER) Nuclear receptor subfamily 3 group A member 1
Type:
Protein
Mol. Mass.:
66230.44
Organism:
Homo sapiens (Human)
Description:
P03372
Residue:
595
  
Inhibitor
Name:
BDBM50204803
Synonyms:
2-(2-phenyl-1H-indol-3-yl)-N-(4-phenylbutan-2-yl)acetamide | CHEMBL241300
Type:
Small organic molecule
Emp. Form.:
C26H26N2O
Mol. Mass.:
382.4974
SMILES:
CC(CCc1ccccc1)NC(=O)Cc1c([nH]c2ccccc12)-c1ccccc1
: