Target
M1 family aminopeptidase
Ligand
BDBM50206550
Substrate
Meas. Tech.
ChEMBL_428661 (CHEMBL915808)
IC50
41±n/a nM
Citation
 Flipo, MBeghyn, TLeroux, VFlorent, IDeprez, BPDeprez-Poulain, RF Novel selective inhibitors of the zinc plasmodial aminopeptidase PfA-M1 as potential antimalarial agents. J Med Chem 50:1322-34 (2007)  
Target
Name:
M1 family aminopeptidase
Synonyms:
AMPN_PLAF7 Zinc aminopeptidase | m1-family aminopeptidase
Type:
PROTEIN
Mol. Mass.:
126072.31
Organism:
Plasmodium falciparum (isolate FcB1 / Columbia)
Description:
ChEMBL_735637
Residue:
1085
  
Inhibitor
Name:
BDBM50206550
Synonyms:
2-benzyl-N-hydroxy-N'-(2-methyl-benzyl)-malonamide | CHEMBL219611
Type:
Small organic molecule
Emp. Form.:
C18H20N2O3
Mol. Mass.:
312.363
SMILES:
Cc1ccccc1CNC(=O)C(Cc1ccccc1)C(=O)NO
: