Target
M1 family aminopeptidase
Ligand
BDBM50206558
Substrate
Meas. Tech.
ChEMBL_428661 (CHEMBL915808)
IC50
13±n/a nM
Citation
 Flipo, MBeghyn, TLeroux, VFlorent, IDeprez, BPDeprez-Poulain, RF Novel selective inhibitors of the zinc plasmodial aminopeptidase PfA-M1 as potential antimalarial agents. J Med Chem 50:1322-34 (2007)  
Target
Name:
M1 family aminopeptidase
Synonyms:
AMPN_PLAF7 Zinc aminopeptidase | m1-family aminopeptidase
Type:
PROTEIN
Mol. Mass.:
126072.31
Organism:
Plasmodium falciparum (isolate FcB1 / Columbia)
Description:
ChEMBL_735637
Residue:
1085
  
Inhibitor
Name:
BDBM50206558
Synonyms:
CHEMBL375521 | N-hydroxy-N'-(4-phenyl-butyl)-2-[1-phenyl-meth-(Z)-ylidene]-malonamide
Type:
Small organic molecule
Emp. Form.:
C20H22N2O3
Mol. Mass.:
338.4003
SMILES:
ONC(=O)C(=C/c1ccccc1)\C(=O)NCCCCc1ccccc1
: